Reaction Details
TargetSphingosine 1-phosphate receptor 2
LigandBDBM50148401
Substrate/Competitorn/a
Meas. Tech.ChEMBL_201451 (CHEMBL807596)
IC50 110±n/a nM
Citation Hale, JJDoherty, GToth, LLi, ZMills, SGHajdu, RAnn Keohane, CRosenbach, MMilligan, JShei, GJChrebet, GBergstrom, JCard, DRosen, HMandala, S The discovery of 3-(N-alkyl)aminopropylphosphonic acids as potent S1P receptor agonists. Bioorg Med Chem Lett14:3495-9 (2004) 
 
Sphingosine 1-phosphate receptor 2
Name:Sphingosine 1-phosphate receptor 2
Type:G Protein-Coupled Receptor (GPCR)
Mol. Mass.:38883.16
Organism:Homo sapiens (Human)
Description:Membranes isolated from S1P2-transfected CHO cells were used in ligand binding assay.
Residue:353
BDBM50148401
NameBDBM50148401
Synonyms:(3-Amino-13-phenyl-tridecyl)-phosphonic acid | CHEMBL117031
TypeSmall organic molecule
Emp. Form.C19H34NO3P
Mol. Mass.355.4519
SMILESNC(CCCCCCCCCCc1ccccc1)CCP(O)(O)=O