Reaction Details
TargetSphingosine 1-phosphate receptor 2
LigandBDBM50148411
Substrate/Competitorn/a
Meas. Tech.ChEMBL_201451 (CHEMBL807596)
IC50 12±n/a nM
Citation Hale, JJDoherty, GToth, LLi, ZMills, SGHajdu, RAnn Keohane, CRosenbach, MMilligan, JShei, GJChrebet, GBergstrom, JCard, DRosen, HMandala, S The discovery of 3-(N-alkyl)aminopropylphosphonic acids as potent S1P receptor agonists. Bioorg Med Chem Lett14:3495-9 (2004) 
 
Sphingosine 1-phosphate receptor 2
Name:Sphingosine 1-phosphate receptor 2
Type:G Protein-Coupled Receptor (GPCR)
Mol. Mass.:38883.16
Organism:Homo sapiens (Human)
Description:Membranes isolated from S1P2-transfected CHO cells were used in ligand binding assay.
Residue:353
BDBM50148411
NameBDBM50148411
Synonyms:(3-Hexadecylamino-propyl)-phosphonic acid | CHEMBL115738
TypeSmall organic molecule
Emp. Form.C19H42NO3P
Mol. Mass.363.5154
(O)(O)=O