Reaction Details
TargetAdenosine receptor A1
LigandBDBM50451996
Substrate/Competitorn/a
Meas. Tech.ChEMBL_29448 (CHEMBL641033)
Ki 166±n/a nM
Citation Morrison, CFElzein, EJiang, BIbrahim, PNMarquart, TPalle, VShenk, KDVarkhedkar, VMaa, TWu, LWu, YZeng, DFong, ILustig, DLeung, KZablocki, JA Structure-affinity relationships of 5'-aromatic ethers and 5'-aromatic sulfides as partial A1 adenosine agonists, potential supraventricular anti-arrhythmic agents. Bioorg Med Chem Lett14:3793-7 (2004) 
 
Adenosine receptor A1
Name:Adenosine receptor A1
Type:Enzyme Catalytic Domain
Mol. Mass.:36501.39
Organism:GUINEA PIG
Description:ADENOSINE A1 ADORA1 GUINEA PIG::P47745
Residue:326
BDBM50451996
NameBDBM50451996
Synonyms:CHEMBL608020
TypeSmall organic molecule
Emp. Form.C18H22N6O3S2
Mol. Mass.434.536
SMILESO[C@@H]1[C@@H](CSc2nccs2)OC([C@@H]1O)n1cnc2c(NC3CCCC3)ncnc12