Reaction Details
TargetAdenosine receptor A1
LigandBDBM50451990
Substrate/Competitorn/a
Meas. Tech.ChEMBL_29585 (CHEMBL640243)
Ki 614±n/a nM
Citation Morrison, CFElzein, EJiang, BIbrahim, PNMarquart, TPalle, VShenk, KDVarkhedkar, VMaa, TWu, LWu, YZeng, DFong, ILustig, DLeung, KZablocki, JA Structure-affinity relationships of 5'-aromatic ethers and 5'-aromatic sulfides as partial A1 adenosine agonists, potential supraventricular anti-arrhythmic agents. Bioorg Med Chem Lett14:3793-7 (2004) 
 
Adenosine receptor A1
Name:Adenosine receptor A1
Type:Enzyme Catalytic Domain
Mol. Mass.:36501.39
Organism:GUINEA PIG
Description:ADENOSINE A1 ADORA1 GUINEA PIG::P47745
Residue:326
BDBM50451990
NameBDBM50451990
Synonyms:CHEMBL609538
TypeSmall organic molecule
Emp. Form.C20H21Cl2N5O4S
Mol. Mass.498.383
SMILESO[C@@H]1[C@@H](CSc2c(Cl)cccc2Cl)OC([C@@H]1O)n1cnc2c(NC3CCOC3)ncnc12