Reaction Details
TargetBeta-glucuronidase
LigandBDBM7458
Substrate/Competitorn/a
Meas. Tech.ChEBML_37581
IC50 2800±n/a nM
Citation Ko, HHWeng, JRTsao, LTYen, MHWang, JPLin, CN Anti-inflammatory flavonoids and pterocarpanoid from Crotalaria pallida and C. assamica. Bioorg Med Chem Lett14:1011-4 (2004) 
 
Beta-glucuronidase
Name:Beta-glucuronidase
Type:PROTEIN
Mol. Mass.:74794.72
Organism:Rattus norvegicus
Description:ChEMBL_37581
Residue:648
BDBM7458
NameBDBM7458
Synonyms:5,7-dihydroxy-2-(4-hydroxyphenyl)-4H-chromen-4-one Apigenin Apigenin (3) Apigenin, 13 Naringenin, 18 US11337935, Compound Apigenin cid_5280443 | jm5b01461, Compound 90
TypeSmall organic molecule
Emp. Form.C15H10O5
Mol. Mass.270.2369
SMILESOc1ccc(cc1)-c1cc(=O)c2c(O)cc(O)cc2o1