Reaction Details
TargetThromboxane-A synthase
LigandBDBM92497
Substrate/Competitorn/a
Meas. Tech.ChEBML_210443
IC50 32±n/a nM
Citation Iizuka, KAkahane, KMomose, DNakazawa, MTanouchi, TKawamura, MOhyama, IKajiwara, IIguchi, YOkada, TTaniguchi, KMiyamoto, THayashi, M Highly selective inhibitors of thromboxane synthetase. 1. Imidazole derivatives. J Med Chem24:1139-48 (1982) Thromboxane-A synthase
Name:Thromboxane-A synthase
Type:Enzyme
Mol. Mass.:60524.67
Organism:Homo sapiens (Human)
Description:P24557
Residue:533
BDBM92497
NameBDBM92497
Synonyms:CHEMBL542051 | Omega-imidazolyl octanoic acid
TypeFatty acid
Emp. Form.C11H18N2O2
Mol. Mass.210.2728
SMILESOC(=O)CCCCCCCn1ccnc1