Reaction Details
TargetThromboxane-A synthase
LigandBDBM50028747
Substrate/Competitorn/a
Meas. Tech.ChEBML_210443
IC50 400±n/a nM
Citation Iizuka, KAkahane, KMomose, DNakazawa, MTanouchi, TKawamura, MOhyama, IKajiwara, IIguchi, YOkada, TTaniguchi, KMiyamoto, THayashi, M Highly selective inhibitors of thromboxane synthetase. 1. Imidazole derivatives. J Med Chem24:1139-48 (1982) Thromboxane-A synthase
Name:Thromboxane-A synthase
Type:Enzyme
Mol. Mass.:60524.67
Organism:Homo sapiens (Human)
Description:P24557
Residue:533
BDBM50028747
NameBDBM50028747
Synonyms:1-Nonyl-1H-imidazole | CHEMBL15181
TypeSmall organic molecule
Emp. Form.C12H22N2
Mol. Mass.194.3165
SMILESCCCCCCCCCn1ccnc1