Reaction Details
TargetThromboxane-A synthase
LigandBDBM84684
Substrate/Competitorn/a
Meas. Tech.ChEBML_210444
IC50>1000±n/a nM
Citation Tanouchi, TKawamura, MOhyama, IKajiwara, IIguchi, YOkada, TMiyamoto, TTaniguchi, KHayashi, MIizuka, KNakazawa, M Highly selective inhibitors of thromboxane synthetase. 2. Pyridine derivatives. J Med Chem24:1149-55 (1982) Thromboxane-A synthase
Name:Thromboxane-A synthase
Type:Enzyme
Mol. Mass.:60524.67
Organism:Homo sapiens (Human)
Description:P24557
Residue:533
BDBM84684
NameBDBM84684
Synonyms:1-Subsituted 1H-imidazole, 21 | CHEMBL543494
TypeSmall organic molecule
Emp. Form.C8H12N2O2
Mol. Mass.168.1931
SMILESOC(=O)CCCCn1ccnc1