Reaction Details
TargetPyruvate kinase PKLR
LigandBDBM50028624
Substrate/Competitorn/a
Meas. Tech.ChEMBL_160251 (CHEMBL767865)
Ki 2200000±n/a nM
Citation Hai, TTAbo, MHampton, A Species- or isozyme-specific enzyme inhibitors. 9. Selective effects in inhibitions of rat pyruvate kinase isozymes by adenosine 5'-diphosphate derivatives. J Med Chem25:1184-8 (1983) Pyruvate kinase PKLR
Name:Pyruvate kinase PKLR
Type:PROTEIN
Mol. Mass.:62202.26
Organism:Rattus norvegicus
Description:ChEMBL_1359662
Residue:574
BDBM50028624
NameBDBM50028624
Synonyms:CHEMBL3142978 | [6-(6-amino-9H-purin-9-yl)-2-methyltetrahydrofuro[3,4-d][1,3]dioxol-4-yl]methyl trihydrogen diphosphate
TypeSmall organic molecule
Emp. Form.C12H17N5O10P2
Mol. Mass.453.2384
SMILESCC1O[C@@H]2[C@@H](COP(O)(=O)OP(O)(O)=O)O[C@H]([C@@H]2O1)n1cnc2c(N)ncnc12