Reaction Details
TargetPyruvate kinase PKLR
LigandBDBM50367052
Substrate/Competitorn/a
Meas. Tech.ChEMBL_160244 (CHEMBL767858)
Ki 1600000±n/a nM
Citation Hai, TTAbo, MHampton, A Species- or isozyme-specific enzyme inhibitors. 9. Selective effects in inhibitions of rat pyruvate kinase isozymes by adenosine 5'-diphosphate derivatives. J Med Chem25:1184-8 (1983) Pyruvate kinase PKLR
Name:Pyruvate kinase PKLR
Type:PROTEIN
Mol. Mass.:62202.26
Organism:Rattus norvegicus
Description:ChEMBL_1359662
Residue:574
BDBM50367052
NameBDBM50367052
Synonyms:CHEMBL605425
TypeSmall organic molecule
Emp. Form.C13H22N6O10P2
Mol. Mass.484.2955
SMILESCCCNc1nc2c(N)ncnc2n1C1O[C@H](COP(O)(=O)OP(O)(O)=O)[C@@H](O)[C@H]1O