Reaction Details
TargetAromatase
LigandBDBM8885
Substrate/Competitorn/a
Meas. Tech.ChEBML_51026
Ki 600±n/a nM
Citation Foster, ABJarman, MLeung, CSRowlands, MGTaylor, GN Analogues of aminoglutethimide: selective inhibition of cholesterol side-chain cleavage. J Med Chem26:50-4 (1983) Aromatase
Name:Aromatase
Type:Enzyme
Mol. Mass.:57888.92
Organism:Homo sapiens (Human)
Description:P11511
Residue:503
BDBM8885
NameBDBM8885
Synonyms:(1S,2R,10R,11S,14S,15S)-14-hydroxy-2,15-dimethyltetracyclo[8.7.0.0^{2,7}.0^{11,15}]heptadec-6-en-5-one Testosterone US9682960, Testosterone
TypeSteroid
Emp. Form.C19H28O2
Mol. Mass.288.4244
SMILES[H][C@@]12CC[C@H](O)[C@@]1(C)CC[C@@]1([H])[C@@]2([H])CCC2=CC(=O)CC[C@]12C