Reaction Details
TargetNeprilysin
LigandBDBM50139892
Substrate/Competitorn/a
Meas. Tech.ChEBML_64504
IC50 1000±n/a nM
Citation Fournié-Zaluski, MCChaillet, PSoroca-Lucas, EMarçais-Collado, HCostentin, JRoques, BP New carboxyalkyl inhibitors of brain enkephalinase: synthesis, biological activity, and analgesic properties. J Med Chem26:60-5 (1983) Neprilysin
Name:Neprilysin
Type:PROTEIN
Mol. Mass.:85694.36
Organism:Mus musculus
Description:ChEMBL_144448
Residue:750
BDBM50139892
NameBDBM50139892
Synonyms:(S)-2-((S)-2-Amino-3-phenyl-propionylamino)-propionic acid CHEMBL429950 | Phe-Ala
TypeSmall organic molecule
Emp. Form.C12H16N2O3
Mol. Mass.236.267
SMILESC[C@H](NC(=O)[C@@H](N)Cc1ccccc1)C(O)=O