Reaction Details
TargetAngiotensin-converting enzyme
LigandBDBM50367217
Substrate/Competitorn/a
Meas. Tech.ChEBML_34798
IC50 16±n/a nM
Citation Suh, JTSkiles, JWWilliams, BEYoussefyeh, RDJones, HLoev, BNeiss, ESSchwab, AMann, WSKhandwala, A Angiotensin-converting enzyme inhibitors. New orally active antihypertensive (mercaptoalkanoyl)- and [(acylthio)alkanoyl]glycine derivatives. J Med Chem28:57-66 (1985) Angiotensin-converting enzyme
Name:Angiotensin-converting enzyme
Type:n/a
Mol. Mass.:150405.15
Organism:Oryctolagus cuniculus
Description:n/a
Residue:1310
BDBM50367217
NameBDBM50367217
Synonyms:CHEMBL1907938
TypeSmall organic molecule
Emp. Form.C11H19NO3S
Mol. Mass.245.338
SMILESC[C@H](CS)C(=O)N(CC(O)=O)C1CCCC1