Reaction Details
TargetNeprilysin
LigandBDBM50025911
Substrate/Competitorn/a
Meas. Tech.ChEBML_64518
IC50 700±n/a nM
Citation Fournié-Zaluski, MCCoulaud, ABouboutou, RChaillet, PDevin, JWaksman, GCostentin, JRoques, BP New bidentates as full inhibitors of enkephalin-degrading enzymes: synthesis and analgesic properties. J Med Chem28:1158-69 (1985) Neprilysin
Name:Neprilysin
Type:Protein
Mol. Mass.:85789.59
Organism:Rattus norvegicus (Rat)
Description:P07861
Residue:750
BDBM50025911
NameBDBM50025911
Synonyms:2-Benzyl-N-carboxymethyl-malonamic acid | CHEMBL17095
TypeSmall organic molecule
Emp. Form.C12H13NO5
Mol. Mass.251.2353
SMILESOC(=O)CNC(=O)C(Cc1ccccc1)C(O)=O