Reaction Details
TargetNeprilysin
LigandBDBM50025912
Substrate/Competitorn/a
Meas. Tech.ChEBML_64518
IC50 750±n/a nM
Citation Fournié-Zaluski, MCCoulaud, ABouboutou, RChaillet, PDevin, JWaksman, GCostentin, JRoques, BP New bidentates as full inhibitors of enkephalin-degrading enzymes: synthesis and analgesic properties. J Med Chem28:1158-69 (1985) Neprilysin
Name:Neprilysin
Type:Protein
Mol. Mass.:85789.59
Organism:Rattus norvegicus (Rat)
Description:P07861
Residue:750
BDBM50025912
NameBDBM50025912
Synonyms:2-Benzyl-N-(benzylcarbamoyl-methyl)-N'-hydroxy-malonamide | CHEMBL16568
TypeSmall organic molecule
Emp. Form.C19H21N3O4
Mol. Mass.355.3877
SMILESONC(=O)C(Cc1ccccc1)C(=O)NCC(=O)NCc1ccccc1