Reaction Details
TargetNeprilysin
LigandBDBM50025919
Substrate/Competitorn/a
Meas. Tech.ChEBML_64518
IC50 850±n/a nM
Citation Fournié-Zaluski, MCCoulaud, ABouboutou, RChaillet, PDevin, JWaksman, GCostentin, JRoques, BP New bidentates as full inhibitors of enkephalin-degrading enzymes: synthesis and analgesic properties. J Med Chem28:1158-69 (1985) Neprilysin
Name:Neprilysin
Type:Protein
Mol. Mass.:85789.59
Organism:Rattus norvegicus (Rat)
Description:P07861
Residue:750
BDBM50025919
NameBDBM50025919
Synonyms:2-Benzyl-N-hydroxy-N'-[(3-methyl-butylcarbamoyl)-methyl]-malonamide | CHEMBL17084
TypeSmall organic molecule
Emp. Form.C17H25N3O4
Mol. Mass.335.3981
SMILESCC(C)CCNC(=O)CNC(=O)C(Cc1ccccc1)C(=O)NO