Reaction Details
TargetS-adenosylmethionine synthase isoform type-1/type-2
LigandBDBM50118232
Substrate/Competitorn/a
Meas. Tech.ChEMBL_104961 (CHEMBL878217)
Ki 110000±n/a nM
Citation Kappler, FHai, TTHampton, A Isozyme-specific enzyme inhibitors. 10. Adenosine 5'-triphosphate derivatives as substrates or inhibitors of methionine adenosyltransferases of rat normal and hepatoma tissues. J Med Chem29:318-22 (1986) S-adenosylmethionine synthase isoform type-1/type-2
Name:S-adenosylmethionine synthase isoform type-1/type-2
Synonyms:S-adenosylmethionine synthetase (MAT 1 and MAT 2)
Type:n/a
Mol. Mass.:n/a
Description:ASSAY_ID of ChEMBL is 104961
Components:This complex has 2 components.
Component 1
Name:S-adenosylmethionine synthase isoform type-1
Type:PROTEIN
Mol. Mass.:43692.87
Organism:Rattus norvegicus
Description:ChEMBL_11027
Residue:397
Component 2
Name:S-adenosylmethionine synthase isoform type-2
Synonyms:AdoMet synthetase 2 MAT 2 METK2_RAT Methionine adenosyltransferase 2 S-Adenosylmethionine Synthase (AdoMet) S-adenosylmethionine synthetase gamma form | S-adenosylmethionine synthetase isoform type-2
Type:PROTEIN
Mol. Mass.:43713.68
Organism:Rattus norvegicus
Description:ChEMBL_105118
Residue:395
BDBM50118232
NameBDBM50118232
Synonyms:2-MeSATP CHEMBL336208
TypeSmall organic molecule
Emp. Form.C11H18N5O13P3S
Mol. Mass.553.273
SMILESCSc1nc(N)c2ncn([C@@H]3O[C@H](COP(O)(=O)OP(O)(=O)OP(O)(O)=O)[C@@H](O)[C@H]3O)c2n1