Reaction Details
TargetDihydrofolate reductase
LigandBDBM50011886
Substrate/Competitorn/a
Meas. Tech.ChEBML_54441
IC50 160±n/a nM
Citation Rosowsky, AFreisheim, JHMoran, RGSolan, VCBader, HWright, JERadike-Smith, M Methotrexate analogues. 26. Inhibition of dihydrofolate reductase and folylpolyglutamate synthetase activity and in vitro tumor cell growth by methotrexate and aminopterin analogues containing a basic amino acid side chain. J Med Chem29:655-60 (1986) Dihydrofolate reductase
Name:Dihydrofolate reductase
Type:Enzyme
Mol. Mass.:21608.82
Organism:Mus musculus (Mouse)
Description:n/a
Residue:187
BDBM50011886
NameBDBM50011886
Synonyms:5-Amino-2-{4-[(2,4-diamino-pteridin-6-ylmethyl)-methyl-amino]-benzoylamino}-pentanoic acid | CHEMBL36083
TypeSmall organic molecule
Emp. Form.C20H25N9O3
Mol. Mass.439.471
SMILESCN(Cc1cnc2nc(N)nc(N)c2n1)c1ccc(cc1)C(=O)NC(CCCN)C(O)=O