Reaction Details
TargetMaltase-glucoamylase
LigandBDBM50405397
Substrate/Competitorn/a
Meas. Tech.ChEBML_101862
IC50 4.9±n/a nM
Citation Horii, SFukase, HMatsuo, TKameda, YAsano, NMatsui, K Synthesis and alpha-D-glucosidase inhibitory activity of N-substituted valiolamine derivatives as potential oral antidiabetic agents. J Med Chem29:1038-46 (1986) Maltase-glucoamylase
Name:Maltase-glucoamylase
Type:Enzyme
Mol. Mass.:209817.06
Organism:Homo sapiens (Human)
Description:O43451
Residue:2753
BDBM50405397
NameBDBM50405397
Synonyms:CHEMBL2051983
TypeSmall organic molecule
Emp. Form.C14H27NO9
Mol. Mass.353.3655
SMILESCO[C@H]1O[C@H](C)[C@@H](N[C@H]2C[C@](O)(CO)[C@@H](O)[C@H](O)[C@H]2O)[C@H](O)[C@H]1O