Reaction Details
TargetMu-type opioid receptor
LigandBDBM50016457
Substrate/Competitorn/a
Meas. Tech.ChEMBL_145157 (CHEMBL755961)
Ki 1.8±n/a nM
Citation Portoghese, PSLarson, DLRonsisvalle, GSchiller, PWNguyen, TMLemieux, CTakemori, AE Hybrid bivalent ligands with opiate and enkephalin pharmacophores. J Med Chem30:1991-4 (1987) Mu-type opioid receptor
Name:Mu-type opioid receptor
Type:Enzyme Catalytic Domain
Mol. Mass.:11165.58
Organism:GUINEA PIG
Description:P97266
Residue:98
BDBM50016457
NameBDBM50016457
Synonyms:1N-[10,17-dihydroxy-4-methyl-(13R,14S,17S)-12-oxa-4-azapentacyclo[9.6.1.01,13.05,17.07,18]octadeca-7(18),8,10-trien-14-yl]acetamide | N-[(1S,13R,14S,17S)-10,17-dihydroxy-4-methyl-12-oxa-4-azapentacyclo[9.6.1.0^{1,13}.0^{5,17}.0^{7,18}]octadeca-7(18),8,10-trien-14-yl]acetamide
TypeSmall organic molecule
Emp. Form.C19H24N2O4
Mol. Mass.344.4049
SMILESCN1CC[C@@]23[C@H]4Oc5c2c(CC1[C@]3(O)CC[C@@H]4NC(C)=O)ccc5O