Reaction Details
TargetCarbonic anhydrase 2
LigandBDBM50024221
Substrate/Competitorn/a
Meas. Tech.ChEMBL_45069 (CHEMBL659852)
Ki 3.6±n/a nM
Citation Ponticello, GSFreedman, MBHabecker, CNLyle, PASchwam, HVarga, SLChristy, MERandall, WCBaldwin, JJ Thienothiopyran-2-sulfonamides: a novel class of water-soluble carbonic anhydrase inhibitors. J Med Chem30:591-7 (1987) Carbonic anhydrase 2
Name:Carbonic anhydrase 2
Type:Enzyme
Mol. Mass.:29250.71
Organism:Homo sapiens (Human)
Description:P00918
Residue:260
BDBM50024221
NameBDBM50024221
Synonyms:4-Oxo-5,6-dihydro-4H-thieno[2,3-b]thiopyran-2-sulfonic acid amide | CHEMBL158261
TypeSmall organic molecule
Emp. Form.C7H7NO3S3
Mol. Mass.249.33
SMILESNS(=O)(=O)c1cc2c(SCCC2=O)s1