Reaction Details
TargetCarbonic anhydrase 2
LigandBDBM10882
Substrate/Competitorn/a
Meas. Tech.ChEBML_45070
Ki 0.490000±n/a nM
Citation Ponticello, GSFreedman, MBHabecker, CNLyle, PASchwam, HVarga, SLChristy, MERandall, WCBaldwin, JJ Thienothiopyran-2-sulfonamides: a novel class of water-soluble carbonic anhydrase inhibitors. J Med Chem30:591-7 (1987) Carbonic anhydrase 2
Name:Carbonic anhydrase 2
Type:Enzyme
Mol. Mass.:29250.71
Organism:Homo sapiens (Human)
Description:P00918
Residue:260
BDBM10882
NameBDBM10882
Synonyms:6-ethoxy-1,3-benzothiazole-2-sulfonamide Ethamide Ethoxzolamide Ethoxzolamide, EZM US10172837, Ethoxyzolamide | sulfonamide 3
TypeSmall organic molecule
Emp. Form.C9H10N2O3S2
Mol. Mass.258.317
SMILESCCOc1ccc2nc(sc2c1)S(N)(=O)=O