Reaction Details
TargetThymidylate synthase
LigandBDBM50022385
Substrate/Competitorn/a
Meas. Tech.ChEBML_209112
IC50 160000±n/a nM
Citation DeGraw, JIColwell, WTBrown, VHSato, MKisliuk, RLGaumont, YThorndike, JSirotnak, FM Synthesis and biological evaluation of 8-deazahomofolic acid and its tetrahydro derivative. J Med Chem31:150-3 (1988) Thymidylate synthase
Name:Thymidylate synthase
Type:Enzyme
Mol. Mass.:36576.54
Organism:Lactobacillus casei
Description:n/a
Residue:316
BDBM50022385
NameBDBM50022385
Synonyms:2-{4-[2-(2-Amino-4-hydroxy-pyrido[3,2-d]pyrimidin-6-yl)-ethylamino]-benzoylamino}-pentanedioic acid | CHEMBL36674
TypeSmall organic molecule
Emp. Form.C21H22N6O6
Mol. Mass.454.436
SMILESNc1nc2ccc(CCNc3ccc(cc3)C(=O)NC(CCC(O)=O)C(O)=O)nc2c(=O)[nH]1