Reaction Details
TargetDihydrofolate reductase
LigandBDBM18050
Substrate/Competitorn/a
Meas. Tech.ChEBML_54903
IC50 16±n/a nM
Citation DeGraw, JIColwell, WTBrown, VHSato, MKisliuk, RLGaumont, YThorndike, JSirotnak, FM Synthesis and biological evaluation of 8-deazahomofolic acid and its tetrahydro derivative. J Med Chem31:150-3 (1988) Dihydrofolate reductase
Name:Dihydrofolate reductase
Type:PROTEIN
Mol. Mass.:18437.08
Organism:Lactobacillus casei
Description:ChEMBL_1357878
Residue:163
BDBM18050
NameBDBM18050
Synonyms:2-[(4-{[(2,4-diaminopteridin-6-yl)methyl](methyl)amino}phenyl)formamido]pentanedioic acid MTX cid_126941
TypeSmall organic molecule
Emp. Form.C20H22N8O5
Mol. Mass.454.4393
SMILESCN(Cc1cnc2nc(N)nc(N)c2n1)c1ccc(cc1)C(=O)N[C@@H](CCC(O)=O)C(O)=O