Reaction Details
Target5-hydroxytryptamine receptor 1A
LigandBDBM50011265
Substrate/Competitorn/a
Meas. Tech.ChEMBL_850 (CHEMBL615906)
IC50 129±n/a nM
Citation Mellin, CBjörk, LKarlén, AJohansson, AMSundell, SKenne, LNelson, DLAndén, NEHacksell, U Central dopaminergic and 5-hydroxytryptaminergic effects of C3-methylated derivatives of 8-hydroxy-2-(di-n-propylamino)tetralin. J Med Chem31:1130-40 (1988) 5-hydroxytryptamine receptor 1A
Name:5-hydroxytryptamine receptor 1A
Type:G Protein-Coupled Receptor (GPCR)
Mol. Mass.:46445.29
Organism:Rattus norvegicus (rat)
Description:Binding assays were performed using rat hippocampal membranes.
Residue:422
BDBM50011265
NameBDBM50011265
Synonyms:(+)-7-Dipropylamino-6-methyl-5,6,7,8-tetrahydro-naphthalen-1-ol; hydrobromide (+/-)-7-Dipropylamino-6-methyl-5,6,7,8-tetrahydro-naphthalen-1-ol; hydrobromide 7-Dipropylamino-6-methyl-5,6,7,8-tetrahydro-naphthalen-1-ol; hydrobromide CHEMBL544899
TypeSmall organic molecule
Emp. Form.C17H27NO
Mol. Mass.261.4024
SMILESCCCN(CCC)[C@H]1Cc2c(O)cccc2C[C@@H]1C