Reaction Details
TargetRenin
LigandBDBM50367760
Substrate/Competitorn/a
Meas. Tech.ChEBML_196299
IC50 370±n/a nM
Citation Hui, KYHoltzman, EJQuinones, MAHollenberg, NKHaber, E Design of rat renin inhibitory peptides. J Med Chem31:1679-86 (1988) Renin
Name:Renin
Type:PROTEIN
Mol. Mass.:44272.67
Organism:Rattus norvegicus
Description:ChEMBL_222765
Residue:402
BDBM50367760
NameBDBM50367760
Synonyms:CHEMBL2367544
TypeSmall organic molecule
Emp. Form.C57H73N13O9
Mol. Mass.1084.2712
SMILESCC[C@H](C)[C@H](NC(=O)C[C@H](O)[C@H](Cc1ccccc1)NC(=O)[C@H](Cc1c[nH]cn1)NC(=O)[C@H](Cc1ccccc1)NC(=O)[C@H]1CCCN1C(=O)[C@H](Cc1c[nH]cn1)NC(=O)[C@H]1CCCN1)C(=O)N[C@@H](Cc1ccccc1)C(N)=O