Reaction Details
TargetRenin
LigandBDBM50367762
Substrate/Competitorn/a
Meas. Tech.ChEBML_196299
IC50 105000±n/a nM
Citation Hui, KYHoltzman, EJQuinones, MAHollenberg, NKHaber, E Design of rat renin inhibitory peptides. J Med Chem31:1679-86 (1988) Renin
Name:Renin
Type:PROTEIN
Mol. Mass.:44272.67
Organism:Rattus norvegicus
Description:ChEMBL_222765
Residue:402
BDBM50367762
NameBDBM50367762
Synonyms:CHEMBL1790272
TypeSmall organic molecule
Emp. Form.C47H69N13O11
Mol. Mass.992.1313
SMILESCC(C)C[C@H](NC(=O)[C@H](Cc1cnc[nH]1)NC(=O)[C@H](Cc1ccccc1)NC(=O)[C@H]1CCCN1C(=O)[C@H](Cc1cnc[nH]1)NC(=O)[C@H]1CCCN1)[C@@H](O)CC(=O)N[C@@H]([C@H](C)O)C(=O)N[C@@H]([C@H](C)O)C(N)=O