Reaction Details
TargetRenin
LigandBDBM50021996
Substrate/Competitorn/a
Meas. Tech.ChEBML_196299
IC50 270±n/a nM
Citation Hui, KYHoltzman, EJQuinones, MAHollenberg, NKHaber, E Design of rat renin inhibitory peptides. J Med Chem31:1679-86 (1988) Renin
Name:Renin
Type:PROTEIN
Mol. Mass.:44272.67
Organism:Rattus norvegicus
Description:ChEMBL_222765
Residue:402
BDBM50021996
NameBDBM50021996
Synonyms:Ac-His-Pro-Phe-His-Statine-Leu-Val-NH2 | CHEMBL295219
TypeSmall organic molecule
Emp. Form.C47H70N12O9
Mol. Mass.947.1337
SMILESCC(C)C[C@H](NC(=O)[C@H](Cc1cnc[nH]1)NC(=O)[C@H](Cc1ccccc1)NC(=O)[C@H]1CCCN1C(=O)[C@H](Cc1cnc[nH]1)NC(C)=O)[C@@H](O)CC(=O)N[C@@H](CC(C)C)C(=O)N[C@@H](C(C)C)C(N)=O