Reaction Details
TargetRenin
LigandBDBM50022009
Substrate/Competitorn/a
Meas. Tech.ChEBML_196299
IC50 1300±n/a nM
Citation Hui, KYHoltzman, EJQuinones, MAHollenberg, NKHaber, E Design of rat renin inhibitory peptides. J Med Chem31:1679-86 (1988) Renin
Name:Renin
Type:PROTEIN
Mol. Mass.:44272.67
Organism:Rattus norvegicus
Description:ChEMBL_222765
Residue:402
BDBM50022009
NameBDBM50022009
Synonyms:CHEMBL263849 | Pro-His-Pro-Phe-His-AHPPA-Val-Tyr-Lys-NH2
TypeSmall organic molecule
Emp. Form.C62H83N15O11
Mol. Mass.1214.4163
SMILESCC(C)[C@H](NC(=O)C[C@H](O)[C@H](Cc1ccccc1)NC(=O)[C@H](Cc1cnc[nH]1)NC(=O)[C@H](Cc1ccccc1)NC(=O)[C@H]1CCCN1C(=O)[C@H](Cc1cnc[nH]1)NC(=O)[C@H]1CCCN1)C(=O)N[C@@H](Cc1ccc(O)cc1)C(=O)NC(CCCCN)C(N)=O