Reaction Details
TargetRenin
LigandBDBM50022021
Substrate/Competitorn/a
Meas. Tech.ChEBML_196299
IC50 42±n/a nM
Citation Hui, KYHoltzman, EJQuinones, MAHollenberg, NKHaber, E Design of rat renin inhibitory peptides. J Med Chem31:1679-86 (1988) Renin
Name:Renin
Type:PROTEIN
Mol. Mass.:44272.67
Organism:Rattus norvegicus
Description:ChEMBL_222765
Residue:402
BDBM50022021
NameBDBM50022021
Synonyms:1-(2-Acetylamino-3-phenyl-propionyl)-pyrrolidine-2-carboxylic acid {1-[1-(1-{2-[1-(1-carbamoyl-2-phenyl-ethylcarbamoyl)-3-methyl-butylcarbamoyl]-1-hydroxy-ethyl}-3-methyl-butylcarbamoyl)-2-methyl-propylcarbamoyl]-2-phenyl-ethyl}-amide | CHEMBL217036
TypeSmall organic molecule
Emp. Form.C53H74N8O9
Mol. Mass.967.2029
SMILESCC(C)C[C@H](NC(=O)[C@@H](NC(=O)[C@H](Cc1ccccc1)NC(=O)[C@H]1CCCN1C(=O)[C@H](Cc1ccccc1)NC(C)=O)C(C)C)[C@@H](O)CC(=O)N[C@@H](CC(C)C)C(=O)N[C@@H](Cc1ccccc1)C(N)=O