Reaction Details
TargetNeprilysin
LigandBDBM50002035
Substrate/Competitorn/a
Meas. Tech.ChEBML_144760
IC50 12±n/a nM
Citation Hernandez, JFSoleilhac, JMRoques, BPFournié-Zaluski, MC Retro-inverso concept applied to the complete inhibitors of enkephalin-degrading enzymes. J Med Chem31:1825-31 (1988) Neprilysin
Name:Neprilysin
Type:Enzyme
Mol. Mass.:85570.75
Organism:Oryctolagus cuniculus (rabbit)
Description:NEP was purified to homogeneity from rabbit kidney.
Residue:750
BDBM50002035
NameBDBM50002035
Synonyms:(2-Hydroxycarbamoyl-3-phenyl-propionylamino)-acetic acid CHEMBL17107
TypeSmall organic molecule
Emp. Form.C12H14N2O5
Mol. Mass.266.25
SMILESONC(=O)C(Cc1ccccc1)C(=O)NCC(O)=O