Reaction Details
TargetMuscarinic acetylcholine receptor M2
LigandBDBM50018225
Substrate/Competitorn/a
Meas. Tech.ChEMBL_140183 (CHEMBL744900)
Ki 42±n/a nM
Citation Leader, HSmejkal, RMPayne, CSPadilla, FNDoctor, BPGordon, RKChiang, PK Binary antidotes for organophosphate poisoning: aprophen analogues that are both antimuscarinics and carbamates. J Med Chem32:1522-8 (1989) Muscarinic acetylcholine receptor M2
Name:Muscarinic acetylcholine receptor M2
Type:Enzyme Catalytic Domain
Mol. Mass.:51555.53
Organism:RAT
Description:P10980
Residue:466
BDBM50018225
NameBDBM50018225
Synonyms:2-(4-Dimethylcarbamoyloxy-phenyl)-2-phenyl-propionic acid 2-diethylamino-ethyl ester | CHEMBL416974
TypeSmall organic molecule
Emp. Form.C24H32N2O4
Mol. Mass.412.5219
SMILESCCN(CC)CCOC(=O)C(C)(c1ccccc1)c1ccc(OC(=O)N(C)C)cc1