Reaction Details
TargetMuscarinic acetylcholine receptor M2
LigandBDBM50018229
Substrate/Competitorn/a
Meas. Tech.ChEBML_140183
Ki 5.6±n/a nM
Citation Leader, HSmejkal, RMPayne, CSPadilla, FNDoctor, BPGordon, RKChiang, PK Binary antidotes for organophosphate poisoning: aprophen analogues that are both antimuscarinics and carbamates. J Med Chem32:1522-8 (1989) Muscarinic acetylcholine receptor M2
Name:Muscarinic acetylcholine receptor M2
Type:Enzyme Catalytic Domain
Mol. Mass.:51555.53
Organism:RAT
Description:P10980
Residue:466
BDBM50018229
NameBDBM50018229
Synonyms:2-(4-Hydroxy-phenyl)-2-phenyl-propionic acid 2-diethylamino-ethyl ester | CHEMBL37372
TypeSmall organic molecule
Emp. Form.C21H27NO3
Mol. Mass.341.444
SMILESCCN(CC)CCOC(=O)C(C)(c1ccccc1)c1ccc(O)cc1