Reaction Details
TargetSodium-dependent serotonin transporter
LigandBDBM50010874
Substrate/Competitorn/a
Meas. Tech.ChEBML_177402
IC50 180±n/a nM
Citation Yardley, JPHusbands, GEStack, GButch, JBicksler, JMoyer, JAMuth, EAAndree, TFletcher, HJames, MN 2-Phenyl-2-(1-hydroxycycloalkyl)ethylamine derivatives: synthesis and antidepressant activity. J Med Chem33:2899-905 (1990) Sodium-dependent serotonin transporter
Name:Sodium-dependent serotonin transporter
Type:Multi-pass membrane protein
Mol. Mass.:70168.43
Organism:Rattus norvegicus (rat)
Description:P31652
Residue:630
BDBM50010874
NameBDBM50010874
Synonyms:1-(1-(4-chlorophenyl)-2-(dimethylamino)ethyl)cyclohexanol CHEMBL420644
TypeSmall organic molecule
Emp. Form.C16H24ClNO
Mol. Mass.281.821
SMILESCN(C)CC(c1ccc(Cl)cc1)C1(O)CCCCC1