Reaction Details
TargetCholecystokinin receptor type A
LigandBDBM50002528
Substrate/Competitorn/a
Meas. Tech.ChEBML_49717
IC50 3.8±n/a nM
Citation Shiosaki, KLin, CWKopecka, HCraig, RABianchi, BRMiller, TRWitte, DGStashko, MNadzan, AM Development of potent and selective CCK-A receptor agonists from Boc-CCK-4: tetrapeptides containing Lys(N epsilon)-amide residues. J Med Chem35:2007-14 (1992) Cholecystokinin receptor type A
Name:Cholecystokinin receptor type A
Type:n/a
Mol. Mass.:48229.77
Organism:Cavia porcellus
Description:n/a
Residue:430
BDBM50002528
NameBDBM50002528
Synonyms:3-{2-[2-tert-Butoxycarbonylamino-3-(1H-indol-3-yl)-propionylamino]-6-[(6-hydroxy-naphthalene-2-carbonyl)-amino]-hexanoylamino}-N-(1-carbamoyl-2-phenyl-ethyl)-N-methyl-succinamic acid; hydrate | CHEMBL413768
TypeSmall organic molecule
Emp. Form.C47H55N7O10
Mol. Mass.877.9805
SMILESCN([C@@H](Cc1ccccc1)C(N)=O)C(=O)[C@H](CC(O)=O)NC(=O)[C@H](CCCCNC(=O)c1ccc2cc(O)ccc2c1)NC(=O)[C@H](Cc1c[nH]c2ccccc12)NC(=O)OC(C)(C)C