Reaction Details
TargetDelta-type opioid receptor
LigandBDBM50001108
Substrate/Competitorn/a
Meas. Tech.ChEBML_146441
Ki 113±n/a nM
Citation Vecchietti, VClarke, GDColle, RDondio, GGiardina, GPetrone, GSbacchi, M Substituted 1-(aminomethyl)-2-(arylacetyl)-1,2,3,4-tetrahydroisoquinolines: a novel class of very potent antinociceptive agents with varying degrees of selectivity for kappa and mu opioid receptors. J Med Chem35:2970-8 (1992) Delta-type opioid receptor
Name:Delta-type opioid receptor
Type:G Protein-Coupled Receptor (GPCR)
Mol. Mass.:40382.98
Organism:Homo sapiens (Human)
Description:Competition binding assays were carried out using membrane preparations from transfected HN9.10 cells that constitutively expressed the delta opioid receptor.
Residue:372
BDBM50001108
NameBDBM50001108
Synonyms:2-(3,4-Dichloro-phenyl)-1-(1-pyrrolidin-1-ylmethyl-3,4-dihydro-1H-isoquinolin-2-yl)-ethanone 2-(3,4-Dichloro-phenyl)-1-(1-pyrrolidin-1-ylmethyl-3,4-dihydro-1H-isoquinolin-2-yl)-ethanone;HCl | CHEMBL275025
TypeSmall organic molecule
Emp. Form.C22H24Cl2N2O
Mol. Mass.403.345
SMILESClc1ccc(CC(=O)N2CCc3ccccc3C2CN2CCCC2)cc1Cl