Reaction Details
TargetDelta-type opioid receptor
LigandBDBM50001105
Substrate/Competitorn/a
Meas. Tech.ChEBML_146441
Ki 158±n/a nM
Citation Vecchietti, VClarke, GDColle, RDondio, GGiardina, GPetrone, GSbacchi, M Substituted 1-(aminomethyl)-2-(arylacetyl)-1,2,3,4-tetrahydroisoquinolines: a novel class of very potent antinociceptive agents with varying degrees of selectivity for kappa and mu opioid receptors. J Med Chem35:2970-8 (1992) Delta-type opioid receptor
Name:Delta-type opioid receptor
Type:G Protein-Coupled Receptor (GPCR)
Mol. Mass.:40382.98
Organism:Homo sapiens (Human)
Description:Competition binding assays were carried out using membrane preparations from transfected HN9.10 cells that constitutively expressed the delta opioid receptor.
Residue:372
BDBM50001105
NameBDBM50001105
Synonyms:2-(3,4-Dichloro-phenyl)-1-(4-methyl-1-pyrrolidin-1-ylmethyl-3,4-dihydro-1H-isoquinolin-2-yl)-ethanone | CHEMBL101396
TypeSmall organic molecule
Emp. Form.C23H26Cl2N2O
Mol. Mass.417.371
SMILESC[C@@H]1CN(C(CN2CCCC2)c2ccccc12)C(=O)Cc1ccc(Cl)c(Cl)c1