Reaction Details
TargetGlutamate receptor ionotropic, NMDA 1
LigandBDBM50002699
Substrate/Competitorn/a
Meas. Tech.ChEBML_140542
Ki>10000±n/a nM
Citation McQuaid, LASmith, ECSouth, KKMitch, CHSchoepp, DDTrue, RACalligaro, DOO'Malley, PJLodge, DOrnstein, PL Synthesis and excitatory amino acid pharmacology of a series of heterocyclic-fused quinoxalinones and quinazolinones. J Med Chem35:3319-24 (1992) Glutamate receptor ionotropic, NMDA 1
Name:Glutamate receptor ionotropic, NMDA 1
Type:Enzyme Catalytic Domain
Mol. Mass.:105533.40
Organism:RAT
Description:P35439
Residue:938
BDBM50002699
NameBDBM50002699
Synonyms:7,8-Difluoro-5H-[1,2,4]triazolo[4,3-a]quinoxalin-4-one | CHEMBL112431
TypeSmall organic molecule
Emp. Form.C9H4F2N4O
Mol. Mass.222.1511
SMILESFc1cc2[nH]c(=O)c3nncn3c2cc1F