Reaction Details
TargetGlutamate receptor ionotropic, NMDA 1
LigandBDBM50002700
Substrate/Competitorn/a
Meas. Tech.ChEBML_140542
Ki 1480±n/a nM
Citation McQuaid, LASmith, ECSouth, KKMitch, CHSchoepp, DDTrue, RACalligaro, DOO'Malley, PJLodge, DOrnstein, PL Synthesis and excitatory amino acid pharmacology of a series of heterocyclic-fused quinoxalinones and quinazolinones. J Med Chem35:3319-24 (1992) Glutamate receptor ionotropic, NMDA 1
Name:Glutamate receptor ionotropic, NMDA 1
Type:Enzyme Catalytic Domain
Mol. Mass.:105533.40
Organism:RAT
Description:P35439
Residue:938
BDBM50002700
NameBDBM50002700
Synonyms:1-Butyl-7,8-dichloro-5H-[1,2,4]triazolo[4,3-a]quinoxalin-4-one | CHEMBL112193
TypeSmall organic molecule
Emp. Form.C13H12Cl2N4O
Mol. Mass.311.167
SMILESCCCCc1nnc2n1c1cc(Cl)c(Cl)cc1[nH]c2=O