Reaction Details
TargetGlutamate receptor ionotropic, NMDA 1
LigandBDBM50002705
Substrate/Competitorn/a
Meas. Tech.ChEBML_140542
Ki>10000±n/a nM
Citation McQuaid, LASmith, ECSouth, KKMitch, CHSchoepp, DDTrue, RACalligaro, DOO'Malley, PJLodge, DOrnstein, PL Synthesis and excitatory amino acid pharmacology of a series of heterocyclic-fused quinoxalinones and quinazolinones. J Med Chem35:3319-24 (1992) Glutamate receptor ionotropic, NMDA 1
Name:Glutamate receptor ionotropic, NMDA 1
Type:Enzyme Catalytic Domain
Mol. Mass.:105533.40
Organism:RAT
Description:P35439
Residue:938
BDBM50002705
NameBDBM50002705
Synonyms:8-Chloro-6H-pyrazolo[1,5-c]quinazolin-5-one | CHEMBL114498
TypeSmall organic molecule
Emp. Form.C10H6ClN3O
Mol. Mass.219.627
SMILESClc1ccc2c3ccnn3c(=O)[nH]c2c1