Reaction Details
TargetGlutamate receptor ionotropic, NMDA 1
LigandBDBM50002710
Substrate/Competitorn/a
Meas. Tech.ChEBML_140542
Ki 2850±n/a nM
Citation McQuaid, LASmith, ECSouth, KKMitch, CHSchoepp, DDTrue, RACalligaro, DOO'Malley, PJLodge, DOrnstein, PL Synthesis and excitatory amino acid pharmacology of a series of heterocyclic-fused quinoxalinones and quinazolinones. J Med Chem35:3319-24 (1992) Glutamate receptor ionotropic, NMDA 1
Name:Glutamate receptor ionotropic, NMDA 1
Type:Enzyme Catalytic Domain
Mol. Mass.:105533.40
Organism:RAT
Description:P35439
Residue:938
BDBM50002710
NameBDBM50002710
Synonyms:7,9-Dichloro-5H-[1,2,4]triazolo[4,3-a]quinoxalin-4-one | CHEMBL323414
TypeSmall organic molecule
Emp. Form.C9H4Cl2N4O
Mol. Mass.255.06
SMILESClc1cc(Cl)c2c(c1)[nH]c(=O)c1nncn21