Reaction Details
TargetGlutamate receptor ionotropic, NMDA 1
LigandBDBM50002708
Substrate/Competitorn/a
Meas. Tech.ChEBML_140542
Ki>10000±n/a nM
Citation McQuaid, LASmith, ECSouth, KKMitch, CHSchoepp, DDTrue, RACalligaro, DOO'Malley, PJLodge, DOrnstein, PL Synthesis and excitatory amino acid pharmacology of a series of heterocyclic-fused quinoxalinones and quinazolinones. J Med Chem35:3319-24 (1992) Glutamate receptor ionotropic, NMDA 1
Name:Glutamate receptor ionotropic, NMDA 1
Type:Enzyme Catalytic Domain
Mol. Mass.:105533.40
Organism:RAT
Description:P35439
Residue:938
BDBM50002708
NameBDBM50002708
Synonyms:7-Nitro-5H-1,2,3,5,9b-pentaaza-cyclopenta[a]naphthalen-4-one | CHEMBL110799
TypeSmall organic molecule
Emp. Form.C8H4N6O3
Mol. Mass.232.1558
SMILES[O-][N+](=O)c1ccc2c(c1)[nH]c(=O)c1nnnn21