Reaction Details
TargetGlutamate receptor ionotropic, NMDA 1
LigandBDBM50002695
Substrate/Competitorn/a
Meas. Tech.ChEBML_140542
Ki>10000±n/a nM
Citation McQuaid, LASmith, ECSouth, KKMitch, CHSchoepp, DDTrue, RACalligaro, DOO'Malley, PJLodge, DOrnstein, PL Synthesis and excitatory amino acid pharmacology of a series of heterocyclic-fused quinoxalinones and quinazolinones. J Med Chem35:3319-24 (1992) Glutamate receptor ionotropic, NMDA 1
Name:Glutamate receptor ionotropic, NMDA 1
Type:Enzyme Catalytic Domain
Mol. Mass.:105533.40
Organism:RAT
Description:P35439
Residue:938
BDBM50002695
NameBDBM50002695
Synonyms:7,8-Dichloro-5H-1,2,3,5,9b-pentaaza-cyclopenta[a]naphthalen-4-one | CHEMBL112014
TypeSmall organic molecule
Emp. Form.C8H3Cl2N5O
Mol. Mass.256.048
SMILESClc1cc2[nH]c(=O)c3nnnn3c2cc1Cl