Reaction Details
TargetGlutamate receptor ionotropic, NMDA 1
LigandBDBM50002711
Substrate/Competitorn/a
Meas. Tech.ChEBML_140542
Ki 4580±n/a nM
Citation McQuaid, LASmith, ECSouth, KKMitch, CHSchoepp, DDTrue, RACalligaro, DOO'Malley, PJLodge, DOrnstein, PL Synthesis and excitatory amino acid pharmacology of a series of heterocyclic-fused quinoxalinones and quinazolinones. J Med Chem35:3319-24 (1992) Glutamate receptor ionotropic, NMDA 1
Name:Glutamate receptor ionotropic, NMDA 1
Type:Enzyme Catalytic Domain
Mol. Mass.:105533.40
Organism:RAT
Description:P35439
Residue:938
BDBM50002711
NameBDBM50002711
Synonyms:7,8-Dichloro-1-ethyl-5H-[1,2,4]triazolo[4,3-a]quinoxalin-4-one | CHEMBL109207
TypeSmall organic molecule
Emp. Form.C11H8Cl2N4O
Mol. Mass.283.113
SMILESCCc1nnc2n1c1cc(Cl)c(Cl)cc1[nH]c2=O