Reaction Details
TargetPlatelet-activating factor receptor
LigandBDBM50002828
Substrate/Competitorn/a
Meas. Tech.ChEBML_154987
Ki 2.5±n/a nM
Citation Girotra, NNBiftu, TPonpipom, MMActon, JJAlberts, AWBach, TNBall, RGBugianesi, RLParsons, WHChabala, JC Development, synthesis, and biological evaluation of (-)-trans-(2S,5S)-2-[3-[(2-oxopropyl)sulfonyl]-4-n-propoxy-5-(3- hydroxypropoxy)-phenyl]-5-(3,4,5-trimethoxyphenyl)tetrahydrofuran, a potent orally active platelet-activating factor (PAF) antagonist and its water-soluble prodrug phosphate ester. J Med Chem35:3474-82 (1992) Platelet-activating factor receptor
Name:Platelet-activating factor receptor
Type:Enzyme Catalytic Domain
Mol. Mass.:39219.60
Organism:Homo sapiens (Human)
Description:PAF Platelet activating factor PTAFR HUMAN::P25105
Residue:342
BDBM50002828
NameBDBM50002828
Synonyms:1-{3-(3-Morpholin-4-yl-propoxy)-2-propoxy-5-[(2S,5S)-5-(3,4,5-trimethoxy-phenyl)-tetrahydro-furan-2-yl]-benzenesulfonyl}-propan-2-one | CHEMBL117413
TypeSmall organic molecule
Emp. Form.C32H45NO10S
Mol. Mass.635.765
SMILESCCCOc1c(OCCCN2CCOCC2)cc(cc1S(=O)(=O)CC(C)=O)[C@@H]1CC[C@H](O1)c1cc(OC)c(OC)c(OC)c1