Reaction Details
TargetSodium-dependent dopamine transporter
LigandBDBM50004169
Substrate/Competitorn/a
Meas. Tech.ChEBML_59437
IC50 1.2±n/a nM
Citation Kozikowski, APRoberti, MXiang, LBergmann, JSCallahan, PMCunningham, KAJohnson, KM Structure-activity relationship studies of cocaine: replacement of the C-2 ester group by vinyl argues against H-bonding and provides an esterase-resistant, high-affinity cocaine analogue. J Med Chem35:4764-6 (1993) Sodium-dependent dopamine transporter
Name:Sodium-dependent dopamine transporter
Type:Multi-pass membrane protein
Mol. Mass.:68749.45
Organism:Rattus norvegicus (rat)
Description:P23977
Residue:619
BDBM50004169
NameBDBM50004169
Synonyms:(2S,3S)-3-(4-Chloro-phenyl)-8-methyl-2-vinyl-8-aza-bicyclo[3.2.1]octane CHEMBL281288
TypeSmall organic molecule
Emp. Form.C16H20ClN
Mol. Mass.261.79
SMILESCN1C2CCC1[C@@H](C=C)[C@H](C2)c1ccc(Cl)cc1