Reaction Details
TargetSodium-dependent dopamine transporter
LigandBDBM50035738
Substrate/Competitorn/a
Meas. Tech.ChEBML_59437
IC50 1.6±n/a nM
Citation Kozikowski, APRoberti, MXiang, LBergmann, JSCallahan, PMCunningham, KAJohnson, KM Structure-activity relationship studies of cocaine: replacement of the C-2 ester group by vinyl argues against H-bonding and provides an esterase-resistant, high-affinity cocaine analogue. J Med Chem35:4764-6 (1993) Sodium-dependent dopamine transporter
Name:Sodium-dependent dopamine transporter
Type:Multi-pass membrane protein
Mol. Mass.:68749.45
Organism:Rattus norvegicus (rat)
Description:P23977
Residue:619
BDBM50035738
NameBDBM50035738
Synonyms:(R)-3-(4-Chloro-phenyl)-8-methyl-8-aza-bicyclo[3.2.1]octane-2-carboxylic acid methyl ester 3-(4-Fluoro-phenyl)-8-methyl-8-aza-bicyclo[3.2.1]octane-2-carboxylic acid methyl ester | CHEMBL306208
TypeSmall organic molecule
Emp. Form.C16H20ClNO2
Mol. Mass.293.789
SMILESCOC(=O)C1C2CCC(CC1c1ccc(Cl)cc1)N2C