Reaction Details
TargetReverse transcriptase/RNaseH
LigandBDBM50368510
Substrate/Competitorn/a
Meas. Tech.ChEMBL_196932 (CHEMBL803949)
IC50 243000±n/a nM
Citation Tan, GTWickramasinghe, ABaba, MHughes, SHMohan, PPezzuto, JMSingh, RVerma, S Potential anti-AIDS naphthalenesulfonic acid derivatives. Synthesis and inhibition of HIV-1 induced cytopathogenesis and HIV-1 and HIV-2 reverse transcriptase activities. J Med Chem35:4846-53 (1992) Reverse transcriptase/RNaseH
Name:Reverse transcriptase/RNaseH
Type:PROTEIN
Mol. Mass.:65229.15
Organism:Human immunodeficiency virus 1
Description:ChEMBL_1473730
Residue:566
BDBM50368510
NameBDBM50368510
Synonyms:CHEMBL1788137
TypeSmall organic molecule
Emp. Form.C12H10NO8S2
Mol. Mass.360.34
SMILESCC(=O)Nc1cc(cc2cc(cc(O)c12)S([O-])(=O)=O)S(O)(=O)=O