Reaction Details
TargetReverse transcriptase/RNaseH
LigandBDBM50368513
Substrate/Competitorn/a
Meas. Tech.ChEMBL_196932 (CHEMBL803949)
IC50>1000000±n/a nM
Citation Tan, GTWickramasinghe, ABaba, MHughes, SHMohan, PPezzuto, JMSingh, RVerma, S Potential anti-AIDS naphthalenesulfonic acid derivatives. Synthesis and inhibition of HIV-1 induced cytopathogenesis and HIV-1 and HIV-2 reverse transcriptase activities. J Med Chem35:4846-53 (1992) Reverse transcriptase/RNaseH
Name:Reverse transcriptase/RNaseH
Type:PROTEIN
Mol. Mass.:65229.15
Organism:Human immunodeficiency virus 1
Description:ChEMBL_1473730
Residue:566
BDBM50368513
NameBDBM50368513
Synonyms:CHEMBL1744146
TypeSmall organic molecule
Emp. Form.C22H13NO14S5
Mol. Mass.675.664
SMILES[O-]S(=O)(=O)c1ccc(cc1)-c1ccc(cc1)S(=O)(=O)Nc1cc(cc2cc(cc(c12)S([O-])(=O)=O)S([O-])(=O)=O)S([O-])(=O)=O