Reaction Details
TargetReverse transcriptase/RNaseH
LigandBDBM50368511
Substrate/Competitorn/a
Meas. Tech.ChEBML_196935
IC50 464000±n/a nM
Citation Tan, GTWickramasinghe, ABaba, MHughes, SHMohan, PPezzuto, JMSingh, RVerma, S Potential anti-AIDS naphthalenesulfonic acid derivatives. Synthesis and inhibition of HIV-1 induced cytopathogenesis and HIV-1 and HIV-2 reverse transcriptase activities. J Med Chem35:4846-53 (1992) Reverse transcriptase/RNaseH
Name:Reverse transcriptase/RNaseH
Type:PROTEIN
Mol. Mass.:65229.15
Organism:Human immunodeficiency virus 1
Description:ChEMBL_1473730
Residue:566
BDBM50368511
NameBDBM50368511
Synonyms:CHEMBL1788136
TypeSmall organic molecule
Emp. Form.C17H11NO8S2
Mol. Mass.421.402
SMILESOc1cc(cc2cc(cc(NC(=O)c3ccccc3)c12)S([O-])(=O)=O)S([O-])(=O)=O